{"text_format":"1","workbook":"xlsx","n_sheets":5,"sheets":["Information","Quote","Rate Sheet- $0Down","Rate Sheet- 1 Down","Rate Sheet- 2 Down"],"not_rendered":{"charts":0,"images":3,"macros":1,"external_links":0,"defined_names":46,"comments":1,"pivot_tables":0},"unopened":[],"bounds":{"document_bytes":16777216,"sheet_cells":100000,"rows_first":2000,"rows_last":500,"rows_between":2000,"halvings":0,"cell_chars":16384,"cell_head_chars":4096},"cells_cut":0,"cells_raw":0,"read":"whole","date_system":"1900"}

{"sheet":"Information","index":0,"n_rows":21,"n_cols":10,"rows_kept":21,"cut":false,"hidden":false,"merged":[[14,1,14,4]]}
[null,null,null,null,null,null,null,"2019-12-30"]
[null,null,null,null,null,null,null,{"$f":"TODAY()-H1","v":-95},1,"January"]
[null,null,null,null,null,null,null,{"$f":"CONCATENATE(LOOKUP(MONTH(H1),I2:J16),\" \",DAY(H1),\", \",YEAR(H1))","v":"December 30, 2019"}]
[null,"Lessee Name:","Customer Name",null,null,null,null,null,2,"February"]
[null,"Sales Rep:","Sales Rep",null,null,null,null,null,3,"March"]
[null,"Phone:","Phone",null,null,null,null,null,4,"April"]
[null,"Equipment:","Brief Equipment Description",null,null,null,null,null,5,"May"]
[null,"Pre-Funding:","No"]
[null,"Rate Sheet :","C1"]
[null,"Down Payment:","$0 Down"]
[null,"Equipment Cost:",95000,null,null,null,null,null,6,"June"]
[null,"Points: ",0,{"$f":"(C12/100)+1","v":1},null,null,null,null,7,"July"]
["7)","Document Type:","$1 Buy-Out",null,null,{"$f":"((C12)/100)+1","v":1},null,null,9,"September"]
[null,"Down Payment:",null,"NOT FUNCTIONING YET",null,null,null,null,10,"October"]
[null,{"$f":"IF(H2>0,\"The Lease Rates associated with this quoter have expired. Please contact your Marlin Account Executive at 888-479-9111 for an updated file.\",\" \")","v":" "},null,null,null,null,null,null,11,"November"]
{"$rows_left_out":7}
{"sheet":"Quote","index":1,"n_rows":29,"n_cols":10,"rows_kept":29,"cut":false,"hidden":false,"merged":[[28,1,32,5],[13,2,13,3],[18,2,18,3],[21,1,21,5],[25,2,25,4],[19,1,20,5]]}
[null,null,null,null,null,null,null,null,null,{"$f":"Information!H2","v":-95}]
[]
[]
[]
[]
[null,null,null,{"$f":"IF(J1>0,\"The Lease Rates associated with this quoter have expired. Please contact your Marlin Account Executive at 888-479-9111 for an updated file. The payments listed may be used as an estimate ONLY.  Thank you.\",\"\")","v":""}]
[]
[]
[]
[null,{"$f":"TODAY()","v":"2019-09-26"}]
[]
[null,"This quote has "]
[null," been prepared for:",{"$f":"Information!C4","v":"Customer Name"}]
[null,"Valid through:",{"$f":"Date+60","v":"2019-11-25"}]
[]
{"$rows_left_out":15}
{"sheet":"Rate Sheet- $0Down","index":2,"n_rows":2009,"n_cols":18,"rows_kept":2009,"cut":false,"hidden":true,"merged":[[113,0,113,1],[70,0,70,1]]}
[]
["Lease Plan Rate Factors"]
[2019,null,"RBP - RETAIL",null,null,"2019-12-31"]
[]
[null,null,null,null,"Financed:",{"$f":"(Information!C11+(Information!C11*(Information!C12/100)))","v":95000},null,24,36,48,60]
[null,null,null,null,30,{"$f":"F5*1.01","v":95950},null,{"$f":"IF(Information!$C$9='Rate Sheet- $0Down'!$A$85,VLOOKUP(Information!$C$11,'Rate Sheet- $0Down'!A10:E16,2),IF(Information!$C$9='Rate Sheet- $0Down'!$A$86,VLOOKUP(Information!$C$11,'Rate Sheet- $0Down'!H10:L16,2),IF(Information!$C$9='Rate Sheet- $0Down'!$A$87,VLOOKUP(Information!$C$11,'Rate Sheet- $0Down'!N10:R16,2),IF(Information!$C$9='Rate Sheet- $0Down'!$A$88,VLOOKUP(Information!$C$11,'Rate Sheet- $0Down'!A19:E25,2),IF(Information!$C$9='Rate Sheet- $0Down'!$A$89,VLOOKUP(Information!$C$11,'Rate Sheet- $0Down'!H19:L25,2),IF(Information!$C$9='Rate Sheet- $0Down'!$A$90,VLOOKUP(Information!$C$11,'Rate Sheet- $0Down'!N19:R25,2),IF(Information!$C$9='Rate Sheet- $0Down'!$A$91,VLOOKUP(Information!$C$11,'Rate Sheet- $0Down'!A28:E34,2),IF(Information!$C$9='Rate Sheet- $0Down'!$A$92,VLOOKUP(Information!$C$11,'Rate Sheet- $0Down'!H28:L34,2),IF(Information!$C$9='Rate Sheet- $0Down'!$A$93,VLOOKUP(Information!$C$11,'Rate Sheet- $0Down'!N28:R34,2),IF(Information!$C$9='Rate Sheet- $0Down'!$A$94,VLOOKUP(Information!$C$11,'Rate Sheet- $0Down'!A37:E43,2),IF(Information!$C$9='Rate Sheet- $0Down'!$A$95,VLOOKUP(Information!$C$11,'Rate Sheet- $0Down'!H37:L43,2),IF(Information!$C$9='Rate Sheet- $0Down'!$A$96,VLOOKUP(Information!$C$11,'Rate Sheet- $0Down'!A46:E52,2),\"error\"))))))))))))","v":4.7239999999999997E-2},{"$f":"IF(Information!$C$9='Rate Sheet- $0Down'!$A$85,VLOOKUP(Information!$C$11,'Rate Sheet- $0Down'!A10:E16,3),IF(Information!$C$9='Rate Sheet- $0Down'!$A$86,VLOOKUP(Information!$C$11,'Rate Sheet- $0Down'!H10:L16,3),IF(Information!$C$9='Rate Sheet- $0Down'!$A$87,VLOOKUP(Information!$C$11,'Rate Sheet- $0Down'!N10:R16,3),IF(Information!$C$9='Rate Sheet- $0Down'!$A$88,VLOOKUP(Information!$C$11,'Rate Sheet- $0Down'!A19:E25,3),IF(Information!$C$9='Rate Sheet- $0Down'!$A$89,VLOOKUP(Information!$C$11,'Rate Sheet- $0Down'!H19:L25,3),IF(Information!$C$9='Rate Sheet- $0Down'!$A$90,VLOOKUP(Information!$C$11,'Rate Sheet- $0Down'!N19:R25,3),IF(Information!$C$9='Rate Sheet- $0Down'!$A$91,VLOOKUP(Information!$C$11,'Rate Sheet- $0Down'!A28:E34,3),IF(Information!$C$9='Rate Sheet- $0Down'!$A$92,VLOOKUP(Information!$C$11,'Rate Sheet- $0Down'!H28:L34,3),IF(Information!$C$9='Rate Sheet- $0Down'!$A$93,VLOOKUP(Information!$C$11,'Rate Sheet- $0Down'!N28:R34,3),IF(Information!$C$9='Rate Sheet- $0Down'!$A$94,VLOOKUP(Information!$C$11,'Rate Sheet- $0Down'!A37:E43,3),IF(Information!$C$9='Rate Sheet- $0Down'!$A$95,VLOOKUP(Information!$C$11,'Rate Sheet- $0Down'!H37:L43,3),IF(Information!$C$9='Rate Sheet- $0Down'!$A$96,VLOOKUP(Information!$C$11,'Rate Sheet- $0Down'!A46:E52,3),\"error\"))))))))))))","v":3.2340000000000001E-2},{"$f":"IF(Information!$C$9='Rate Sheet- $0Down'!$A$85,VLOOKUP(Information!$C$11,'Rate Sheet- $0Down'!A10:E16,4),IF(Information!$C$9='Rate Sheet- $0Down'!$A$86,VLOOKUP(Information!$C$11,'Rate Sheet- $0Down'!H10:L16,4),IF(Information!$C$9='Rate Sheet- $0Down'!$A$87,VLOOKUP(Information!$C$11,'Rate Sheet- $0Down'!N10:R16,4),IF(Information!$C$9='Rate Sheet- $0Down'!$A$88,VLOOKUP(Information!$C$11,'Rate Sheet- $0Down'!A19:E25,4),IF(Information!$C$9='Rate Sheet- $0Down'!$A$89,VLOOKUP(Information!$C$11,'Rate Sheet- $0Down'!H19:L25,4),IF(Information!$C$9='Rate Sheet- $0Down'!$A$90,VLOOKUP(Information!$C$11,'Rate Sheet- $0Down'!N19:R25,4),IF(Information!$C$9='Rate Sheet- $0Down'!$A$91,VLOOKUP(Information!$C$11,'Rate Sheet- $0Down'!A28:E34,4),IF(Information!$C$9='Rate Sheet- $0Down'!$A$92,VLOOKUP(Information!$C$11,'Rate Sheet- $0Down'!H28:L34,4),IF(Information!$C$9='Rate Sheet- $0Down'!$A$93,VLOOKUP(Information!$C$11,'Rate Sheet- $0Down'!N28:R34,4),IF(Information!$C$9='Rate Sheet- $0Down'!$A$94,VLOOKUP(Information!$C$11,'Rate Sheet- $0Down'!A37:E43,4),IF(Information!$C$9='Rate Sheet- $0Down'!$A$95,VLOOKUP(Information!$C$11,'Rate Sheet- $0Down'!H37:L43,4),IF(Information!$C$9='Rate Sheet- $0Down'!$A$96,VLOOKUP(Information!$C$11,'Rate Sheet- $0Down'!A46:E52,4),\"error\"))))))))))))","v":2.5049999999999999E-2},{"$f":"IF(Information!$C$9='Rate Sheet- $0Down'!$A$85,VLOOKUP(Information!$C$11,'Rate Sheet- $0Down'!A10:E16,5),IF(Information!$C$9='Rate Sheet- $0Down'!$A$86,VLOOKUP(Information!$C$11,'Rate Sheet- $0Down'!H10:L16,5),IF(Information!$C$9='Rate Sheet- $0Down'!$A$87,VLOOKUP(Information!$C$11,'Rate Sheet- $0Down'!N10:R16,5),IF(Information!$C$9='Rate Sheet- $0Down'!$A$88,VLOOKUP(Information!$C$11,'Rate Sheet- $0Down'!A19:E25,5),IF(Information!$C$9='Rate Sheet- $0Down'!$A$89,VLOOKUP(Information!$C$11,'Rate Sheet- $0Down'!H19:L25,5),IF(Information!$C$9='Rate Sheet- $0Down'!$A$90,VLOOKUP(Information!$C$11,'Rate Sheet- $0Down'!N19:R25,5),IF(Information!$C$9='Rate Sheet- $0Down'!$A$91,VLOOKUP(Information!$C$11,'Rate Sheet- $0Down'!A28:E34,5),IF(Information!$C$9='Rate Sheet- $0Down'!$A$92,VLOOKUP(Information!$C$11,'Rate Sheet- $0Down'!H28:L34,5),IF(Information!$C$9='Rate Sheet- $0Down'!$A$93,VLOOKUP(Information!$C$11,'Rate Sheet- $0Down'!N28:R34,5),IF(Information!$C$9='Rate Sheet- $0Down'!$A$94,VLOOKUP(Information!$C$11,'Rate Sheet- $0Down'!A37:E43,5),IF(Information!$C$9='Rate Sheet- $0Down'!$A$95,VLOOKUP(Information!$C$11,'Rate Sheet- $0Down'!H37:L43,5),IF(Information!$C$9='Rate Sheet- $0Down'!$A$96,VLOOKUP(Information!$C$11,'Rate Sheet- $0Down'!A46:E52,5),\"error\"))))))))))))","v":2.0160000000000001E-2}]
[null,null,null,null,60,{"$f":"F5*1.02","v":96900}]
[null,null,null,null,90,{"$f":"F5*1.03","v":97850}]
["A1",null,null,null,null,null,null,"A2",null,null,null,null,null,"A2"]
[null,24,36,48,60,null,null,null,24,36,48,60,null,null,24,36,48,60]
[1000,4.9333394694852199E-2,3.4374575431876997E-2,2.71536379450165E-2,2.19261863718371E-2,null,null,1000,4.9509999999999998E-2,3.4619999999999998E-2,2.733E-2,2.1989999999999999E-2,null,1000,5.0169999999999999E-2,3.5029999999999999E-2,2.7550000000000002E-2,2.214E-2]
[10000,4.9015832745693599E-2,3.3031761008601897E-2,2.5781065298264599E-2,2.05111361137101E-2,null,null,10000,4.9320000000000003E-2,3.3360000000000001E-2,2.6259999999999999E-2,2.0760000000000001E-2,null,10000,4.9439999999999998E-2,3.3910000000000003E-2,2.6630000000000001E-2,2.0979999999999999E-2]
[30000,4.7349516487208101E-2,3.2276581245264398E-2,2.4730120596288398E-2,1.99106301727346E-2,null,null,30000,4.7660000000000001E-2,3.261E-2,2.5069999999999999E-2,2.009E-2,null,30000,4.7849999999999997E-2,3.2739999999999998E-2,2.5389999999999999E-2,2.044E-2]
[50000,4.5272913424892799E-2,3.1221163647015601E-2,2.4178901937935E-2,1.9402626431288299E-2,null,null,50000,4.5659999999999999E-2,3.15E-2,2.4410000000000001E-2,1.9539999999999998E-2,null,50000,4.58E-2,3.1739999999999997E-2,2.4649999999999998E-2,1.975E-2]
[100000,4.5227291457845098E-2,3.1175154680636901E-2,2.4155574828803001E-2,1.9379334396249601E-2,null,null,100000,4.5589999999999999E-2,3.1469999999999998E-2,2.4369999999999999E-2,1.9519999999999999E-2,null,100000,4.5780000000000001E-2,3.1739999999999997E-2,2.462E-2,1.9730000000000001E-2]
{"$rows_left_out":1995}
{"sheet":"Rate Sheet- 1 Down","index":3,"n_rows":2009,"n_cols":18,"rows_kept":2009,"cut":false,"hidden":true,"merged":[[70,0,70,1]]}
[]
["Lease Plan Rate Factors"]
[2019,null,"RBP - RETAIL",null,null,"2019-12-31"]
[]
[null,null,null,null,null,null,null,24,36,48,60]
[null,null,null,null,null,null,null,{"$f":"IF(Information!$C$9='Rate Sheet- 1 Down'!$A$85,VLOOKUP(Information!$C$11,'Rate Sheet- 1 Down'!A10:E16,2),IF(Information!$C$9='Rate Sheet- 1 Down'!$A$86,VLOOKUP(Information!$C$11,'Rate Sheet- 1 Down'!H10:L16,2),IF(Information!$C$9='Rate Sheet- 1 Down'!$A$87,VLOOKUP(Information!$C$11,'Rate Sheet- 1 Down'!N10:R16,2),IF(Information!$C$9='Rate Sheet- 1 Down'!$A$88,VLOOKUP(Information!$C$11,'Rate Sheet- 1 Down'!A19:E25,2),IF(Information!$C$9='Rate Sheet- 1 Down'!$A$89,VLOOKUP(Information!$C$11,'Rate Sheet- 1 Down'!H19:L25,2),IF(Information!$C$9='Rate Sheet- 1 Down'!$A$90,VLOOKUP(Information!$C$11,'Rate Sheet- 1 Down'!N19:R25,2),IF(Information!$C$9='Rate Sheet- 1 Down'!$A$91,VLOOKUP(Information!$C$11,'Rate Sheet- 1 Down'!A28:E34,2),IF(Information!$C$9='Rate Sheet- 1 Down'!$A$92,VLOOKUP(Information!$C$11,'Rate Sheet- 1 Down'!H28:L34,2),IF(Information!$C$9='Rate Sheet- 1 Down'!$A$93,VLOOKUP(Information!$C$11,'Rate Sheet- 1 Down'!N28:R34,2),IF(Information!$C$9='Rate Sheet- 1 Down'!$A$94,VLOOKUP(Information!$C$11,'Rate Sheet- 1 Down'!A37:E43,2),IF(Information!$C$9='Rate Sheet- 1 Down'!$A$95,VLOOKUP(Information!$C$11,'Rate Sheet- 1 Down'!H37:L43,2),IF(Information!$C$9='Rate Sheet- 1 Down'!$A$96,VLOOKUP(Information!$C$11,'Rate Sheet- 1 Down'!A46:E52,2),\"error\"))))))))))))","v":4.6755890141767703E-2},{"$f":"IF(Information!$C$9='Rate Sheet- 1 Down'!$A$85,VLOOKUP(Information!$C$11,'Rate Sheet- 1 Down'!A10:E16,3),IF(Information!$C$9='Rate Sheet- 1 Down'!$A$86,VLOOKUP(Information!$C$11,'Rate Sheet- 1 Down'!H10:L16,3),IF(Information!$C$9='Rate Sheet- 1 Down'!$A$87,VLOOKUP(Information!$C$11,'Rate Sheet- 1 Down'!N10:R16,3),IF(Information!$C$9='Rate Sheet- 1 Down'!$A$88,VLOOKUP(Information!$C$11,'Rate Sheet- 1 Down'!A19:E25,3),IF(Information!$C$9='Rate Sheet- 1 Down'!$A$89,VLOOKUP(Information!$C$11,'Rate Sheet- 1 Down'!H19:L25,3),IF(Information!$C$9='Rate Sheet- 1 Down'!$A$90,VLOOKUP(Information!$C$11,'Rate Sheet- 1 Down'!N19:R25,3),IF(Information!$C$9='Rate Sheet- 1 Down'!$A$91,VLOOKUP(Information!$C$11,'Rate Sheet- 1 Down'!A28:E34,3),IF(Information!$C$9='Rate Sheet- 1 Down'!$A$92,VLOOKUP(Information!$C$11,'Rate Sheet- 1 Down'!H28:L34,3),IF(Information!$C$9='Rate Sheet- 1 Down'!$A$93,VLOOKUP(Information!$C$11,'Rate Sheet- 1 Down'!N28:R34,3),IF(Information!$C$9='Rate Sheet- 1 Down'!$A$94,VLOOKUP(Information!$C$11,'Rate Sheet- 1 Down'!A37:E43,3),IF(Information!$C$9='Rate Sheet- 1 Down'!$A$95,VLOOKUP(Information!$C$11,'Rate Sheet- 1 Down'!H37:L43,3),IF(Information!$C$9='Rate Sheet- 1 Down'!$A$96,VLOOKUP(Information!$C$11,'Rate Sheet- 1 Down'!A46:E52,3),\"error\"))))))))))))","v":3.2066428634826699E-2},{"$f":"IF(Information!$C$9='Rate Sheet- 1 Down'!$A$85,VLOOKUP(Information!$C$11,'Rate Sheet- 1 Down'!A10:E16,4),IF(Information!$C$9='Rate Sheet- 1 Down'!$A$86,VLOOKUP(Information!$C$11,'Rate Sheet- 1 Down'!H10:L16,4),IF(Information!$C$9='Rate Sheet- 1 Down'!$A$87,VLOOKUP(Information!$C$11,'Rate Sheet- 1 Down'!N10:R16,4),IF(Information!$C$9='Rate Sheet- 1 Down'!$A$88,VLOOKUP(Information!$C$11,'Rate Sheet- 1 Down'!A19:E25,4),IF(Information!$C$9='Rate Sheet- 1 Down'!$A$89,VLOOKUP(Information!$C$11,'Rate Sheet- 1 Down'!H19:L25,4),IF(Information!$C$9='Rate Sheet- 1 Down'!$A$90,VLOOKUP(Information!$C$11,'Rate Sheet- 1 Down'!N19:R25,4),IF(Information!$C$9='Rate Sheet- 1 Down'!$A$91,VLOOKUP(Information!$C$11,'Rate Sheet- 1 Down'!A28:E34,4),IF(Information!$C$9='Rate Sheet- 1 Down'!$A$92,VLOOKUP(Information!$C$11,'Rate Sheet- 1 Down'!H28:L34,4),IF(Information!$C$9='Rate Sheet- 1 Down'!$A$93,VLOOKUP(Information!$C$11,'Rate Sheet- 1 Down'!N28:R34,4),IF(Information!$C$9='Rate Sheet- 1 Down'!$A$94,VLOOKUP(Information!$C$11,'Rate Sheet- 1 Down'!A37:E43,4),IF(Information!$C$9='Rate Sheet- 1 Down'!$A$95,VLOOKUP(Information!$C$11,'Rate Sheet- 1 Down'!H37:L43,4),IF(Information!$C$9='Rate Sheet- 1 Down'!$A$96,VLOOKUP(Information!$C$11,'Rate Sheet- 1 Down'!A46:E52,4),\"error\"))))))))))))","v":2.4857881912926101E-2},{"$f":"IF(Information!$C$9='Rate Sheet- 1 Down'!$A$85,VLOOKUP(Information!$C$11,'Rate Sheet- 1 Down'!A10:E16,5),IF(Information!$C$9='Rate Sheet- 1 Down'!$A$86,VLOOKUP(Information!$C$11,'Rate Sheet- 1 Down'!H10:L16,5),IF(Information!$C$9='Rate Sheet- 1 Down'!$A$87,VLOOKUP(Information!$C$11,'Rate Sheet- 1 Down'!N10:R16,5),IF(Information!$C$9='Rate Sheet- 1 Down'!$A$88,VLOOKUP(Information!$C$11,'Rate Sheet- 1 Down'!A19:E25,5),IF(Information!$C$9='Rate Sheet- 1 Down'!$A$89,VLOOKUP(Information!$C$11,'Rate Sheet- 1 Down'!H19:L25,5),IF(Information!$C$9='Rate Sheet- 1 Down'!$A$90,VLOOKUP(Information!$C$11,'Rate Sheet- 1 Down'!N19:R25,5),IF(Information!$C$9='Rate Sheet- 1 Down'!$A$91,VLOOKUP(Information!$C$11,'Rate Sheet- 1 Down'!A28:E34,5),IF(Information!$C$9='Rate Sheet- 1 Down'!$A$92,VLOOKUP(Information!$C$11,'Rate Sheet- 1 Down'!H28:L34,5),IF(Information!$C$9='Rate Sheet- 1 Down'!$A$93,VLOOKUP(Information!$C$11,'Rate Sheet- 1 Down'!N28:R34,5),IF(Information!$C$9='Rate Sheet- 1 Down'!$A$94,VLOOKUP(Information!$C$11,'Rate Sheet- 1 Down'!A37:E43,5),IF(Information!$C$9='Rate Sheet- 1 Down'!$A$95,VLOOKUP(Information!$C$11,'Rate Sheet- 1 Down'!H37:L43,5),IF(Information!$C$9='Rate Sheet- 1 Down'!$A$96,VLOOKUP(Information!$C$11,'Rate Sheet- 1 Down'!A46:E52,5),\"error\"))))))))))))","v":2.0027614739151399E-2}]
[]
[]
["A1",null,null,null,null,null,null,"A2",null,null,null,null,null,"A2"]
[null,24,36,48,60,null,null,null,24,36,48,60,null,null,24,36,48,60]
[1000,4.8649999999999999E-2,3.397E-2,2.6849999999999999E-2,2.172E-2,null,null,1000,4.8816696851776198E-2,3.4191829555363103E-2,2.7011344148070798E-2,2.1783845523489099E-2,null,1000,4.9404374585569101E-2,3.4579871398594197E-2,2.7224912476557998E-2,2.1927888966395599E-2]
[10000,4.8370000000000003E-2,3.2719999999999999E-2,2.555E-2,2.0369999999999999E-2,null,null,10000,4.8643245140751599E-2,3.30193297675982E-2,2.6003462754390999E-2,2.0603826566685999E-2,null,10000,4.8751616189484002E-2,3.35352343650051E-2,2.6352688491956801E-2,2.08135286293353E-2]
[30000,4.6859999999999999E-2,3.2009999999999997E-2,2.4549999999999999E-2,1.9789999999999999E-2,null,null,30000,4.7135708537080802E-2,3.2317409990474E-2,2.48787551151105E-2,1.9959094619883801E-2,null,30000,4.7309557897354797E-2,3.2441338186124401E-2,2.51757554483358E-2,2.0303037584396399E-2]
[50000,4.4970000000000003E-2,3.1019999999999999E-2,2.4029999999999999E-2,1.9300000000000001E-2,null,null,50000,4.5319844171330503E-2,3.1280418749059201E-2,2.4251247359497401E-2,1.9438256197110301E-2,null,50000,4.5449194732402998E-2,3.1519442620350301E-2,2.4474939206886599E-2,1.9641115954868501E-2]
[100000,4.4929999999999998E-2,3.0980000000000001E-2,2.401E-2,1.9279999999999999E-2,null,null,100000,4.5261118419430098E-2,3.1258739485716398E-2,2.4206648891195101E-2,1.9415791580592999E-2,null,100000,4.5428277148517E-2,3.1512787840255803E-2,2.4452517624981601E-2,1.9618515763125399E-2]
{"$rows_left_out":1995}
{"sheet":"Rate Sheet- 2 Down","index":4,"n_rows":2009,"n_cols":18,"rows_kept":2009,"cut":false,"hidden":true,"merged":[[70,0,70,1]]}
[]
["Lease Plan Rate Factors"]
[2019,null,"RBP - RETAIL",null,null,"2019-12-31"]
[]
[null,null,null,null,null,null,null,24,36,48,60]
[null,null,null,null,null,null,null,{"$f":"IF(Information!$C$9='Rate Sheet- 2 Down'!$A$85,VLOOKUP(Information!$C$11,'Rate Sheet- 2 Down'!A10:E16,2),IF(Information!$C$9='Rate Sheet- 2 Down'!$A$86,VLOOKUP(Information!$C$11,'Rate Sheet- 2 Down'!H10:L16,2),IF(Information!$C$9='Rate Sheet- 2 Down'!$A$87,VLOOKUP(Information!$C$11,'Rate Sheet- 2 Down'!N10:R16,2),IF(Information!$C$9='Rate Sheet- 2 Down'!$A$88,VLOOKUP(Information!$C$11,'Rate Sheet- 2 Down'!A19:E25,2),IF(Information!$C$9='Rate Sheet- 2 Down'!$A$89,VLOOKUP(Information!$C$11,'Rate Sheet- 2 Down'!H19:L25,2),IF(Information!$C$9='Rate Sheet- 2 Down'!$A$90,VLOOKUP(Information!$C$11,'Rate Sheet- 2 Down'!N19:R25,2),IF(Information!$C$9='Rate Sheet- 2 Down'!$A$91,VLOOKUP(Information!$C$11,'Rate Sheet- 2 Down'!A28:E34,2),IF(Information!$C$9='Rate Sheet- 2 Down'!$A$92,VLOOKUP(Information!$C$11,'Rate Sheet- 2 Down'!H28:L34,2),IF(Information!$C$9='Rate Sheet- 2 Down'!$A$93,VLOOKUP(Information!$C$11,'Rate Sheet- 2 Down'!N28:R34,2),IF(Information!$C$9='Rate Sheet- 2 Down'!$A$94,VLOOKUP(Information!$C$11,'Rate Sheet- 2 Down'!A37:E43,2),IF(Information!$C$9='Rate Sheet- 2 Down'!$A$95,VLOOKUP(Information!$C$11,'Rate Sheet- 2 Down'!H37:L43,2),IF(Information!$C$9='Rate Sheet- 2 Down'!$A$96,VLOOKUP(Information!$C$11,'Rate Sheet- 2 Down'!A46:E52,2),\"error\"))))))))))))","v":4.6301649168278697E-2},{"$f":"IF(Information!$C$9='Rate Sheet- 2 Down'!$A$85,VLOOKUP(Information!$C$11,'Rate Sheet- 2 Down'!A10:E16,3),IF(Information!$C$9='Rate Sheet- 2 Down'!$A$86,VLOOKUP(Information!$C$11,'Rate Sheet- 2 Down'!H10:L16,3),IF(Information!$C$9='Rate Sheet- 2 Down'!$A$87,VLOOKUP(Information!$C$11,'Rate Sheet- 2 Down'!N10:R16,3),IF(Information!$C$9='Rate Sheet- 2 Down'!$A$88,VLOOKUP(Information!$C$11,'Rate Sheet- 2 Down'!A19:E25,3),IF(Information!$C$9='Rate Sheet- 2 Down'!$A$89,VLOOKUP(Information!$C$11,'Rate Sheet- 2 Down'!H19:L25,3),IF(Information!$C$9='Rate Sheet- 2 Down'!$A$90,VLOOKUP(Information!$C$11,'Rate Sheet- 2 Down'!N19:R25,3),IF(Information!$C$9='Rate Sheet- 2 Down'!$A$91,VLOOKUP(Information!$C$11,'Rate Sheet- 2 Down'!A28:E34,3),IF(Information!$C$9='Rate Sheet- 2 Down'!$A$92,VLOOKUP(Information!$C$11,'Rate Sheet- 2 Down'!H28:L34,3),IF(Information!$C$9='Rate Sheet- 2 Down'!$A$93,VLOOKUP(Information!$C$11,'Rate Sheet- 2 Down'!N28:R34,3),IF(Information!$C$9='Rate Sheet- 2 Down'!$A$94,VLOOKUP(Information!$C$11,'Rate Sheet- 2 Down'!A37:E43,3),IF(Information!$C$9='Rate Sheet- 2 Down'!$A$95,VLOOKUP(Information!$C$11,'Rate Sheet- 2 Down'!H37:L43,3),IF(Information!$C$9='Rate Sheet- 2 Down'!$A$96,VLOOKUP(Information!$C$11,'Rate Sheet- 2 Down'!A46:E52,3),\"error\"))))))))))))","v":3.1806029364116299E-2},{"$f":"IF(Information!$C$9='Rate Sheet- 2 Down'!$A$85,VLOOKUP(Information!$C$11,'Rate Sheet- 2 Down'!A10:E16,4),IF(Information!$C$9='Rate Sheet- 2 Down'!$A$86,VLOOKUP(Information!$C$11,'Rate Sheet- 2 Down'!H10:L16,4),IF(Information!$C$9='Rate Sheet- 2 Down'!$A$87,VLOOKUP(Information!$C$11,'Rate Sheet- 2 Down'!N10:R16,4),IF(Information!$C$9='Rate Sheet- 2 Down'!$A$88,VLOOKUP(Information!$C$11,'Rate Sheet- 2 Down'!A19:E25,4),IF(Information!$C$9='Rate Sheet- 2 Down'!$A$89,VLOOKUP(Information!$C$11,'Rate Sheet- 2 Down'!H19:L25,4),IF(Information!$C$9='Rate Sheet- 2 Down'!$A$90,VLOOKUP(Information!$C$11,'Rate Sheet- 2 Down'!N19:R25,4),IF(Information!$C$9='Rate Sheet- 2 Down'!$A$91,VLOOKUP(Information!$C$11,'Rate Sheet- 2 Down'!A28:E34,4),IF(Information!$C$9='Rate Sheet- 2 Down'!$A$92,VLOOKUP(Information!$C$11,'Rate Sheet- 2 Down'!H28:L34,4),IF(Information!$C$9='Rate Sheet- 2 Down'!$A$93,VLOOKUP(Information!$C$11,'Rate Sheet- 2 Down'!N28:R34,4),IF(Information!$C$9='Rate Sheet- 2 Down'!$A$94,VLOOKUP(Information!$C$11,'Rate Sheet- 2 Down'!A37:E43,4),IF(Information!$C$9='Rate Sheet- 2 Down'!$A$95,VLOOKUP(Information!$C$11,'Rate Sheet- 2 Down'!H37:L43,4),IF(Information!$C$9='Rate Sheet- 2 Down'!$A$96,VLOOKUP(Information!$C$11,'Rate Sheet- 2 Down'!A46:E52,4),\"error\"))))))))))))","v":2.4670436373121399E-2},{"$f":"IF(Information!$C$9='Rate Sheet- 2 Down'!$A$85,VLOOKUP(Information!$C$11,'Rate Sheet- 2 Down'!A10:E16,5),IF(Information!$C$9='Rate Sheet- 2 Down'!$A$86,VLOOKUP(Information!$C$11,'Rate Sheet- 2 Down'!H10:L16,5),IF(Information!$C$9='Rate Sheet- 2 Down'!$A$87,VLOOKUP(Information!$C$11,'Rate Sheet- 2 Down'!N10:R16,5),IF(Information!$C$9='Rate Sheet- 2 Down'!$A$88,VLOOKUP(Information!$C$11,'Rate Sheet- 2 Down'!A19:E25,5),IF(Information!$C$9='Rate Sheet- 2 Down'!$A$89,VLOOKUP(Information!$C$11,'Rate Sheet- 2 Down'!H19:L25,5),IF(Information!$C$9='Rate Sheet- 2 Down'!$A$90,VLOOKUP(Information!$C$11,'Rate Sheet- 2 Down'!N19:R25,5),IF(Information!$C$9='Rate Sheet- 2 Down'!$A$91,VLOOKUP(Information!$C$11,'Rate Sheet- 2 Down'!A28:E34,5),IF(Information!$C$9='Rate Sheet- 2 Down'!$A$92,VLOOKUP(Information!$C$11,'Rate Sheet- 2 Down'!H28:L34,5),IF(Information!$C$9='Rate Sheet- 2 Down'!$A$93,VLOOKUP(Information!$C$11,'Rate Sheet- 2 Down'!N28:R34,5),IF(Information!$C$9='Rate Sheet- 2 Down'!$A$94,VLOOKUP(Information!$C$11,'Rate Sheet- 2 Down'!A37:E43,5),IF(Information!$C$9='Rate Sheet- 2 Down'!$A$95,VLOOKUP(Information!$C$11,'Rate Sheet- 2 Down'!H37:L43,5),IF(Information!$C$9='Rate Sheet- 2 Down'!$A$96,VLOOKUP(Information!$C$11,'Rate Sheet- 2 Down'!A46:E52,5),\"error\"))))))))))))","v":1.9901657382001E-2}]
[]
[]
["A1",null,null,null,null,null,null,"A2",null,null,null,null,null,"A2"]
[null,24,36,48,60,null,null,null,24,36,48,60,null,null,24,36,48,60]
[1000,4.8014845848862897E-2,3.3577463464225799E-2,2.6554085681606599E-2,2.1520989288317301E-2,null,null,1000,4.8161983108410203E-2,3.3786655989833402E-2,2.6708165490577501E-2,2.1581527946784501E-2,null,1000,4.86908099914777E-2,3.4147187633804997E-2,2.6909696772667399E-2,2.1719001923700802E-2]
[10000,4.7756368386534499E-2,3.2411537172597801E-2,2.5326194333399801E-2,2.0226888583381598E-2,null,null,10000,4.8005759630814201E-2,3.26952689120684E-2,2.5755738501149001E-2,2.04535853287371E-2,null,10000,4.8103374215619998E-2,3.3175858231878498E-2,2.60860035353618E-2,2.0654261677577002E-2]
[30000,4.6393949877935603E-2,3.1752655293220203E-2,2.4380775605221099E-2,1.96751398905213E-2,null,null,30000,4.6645216660238499E-2,3.2040441844005597E-2,2.46902378389878E-2,1.9835974200647099E-2,null,30000,4.6802367483380299E-2,3.2156136160789703E-2,2.4971881182238E-2,2.0165567738804201E-2]
[50000,4.4681333861642102E-2,3.0827900148851499E-2,2.3883040165013601E-2,1.9207158498662599E-2,null,null,50000,4.4999767275851497E-2,3.1070979412431601E-2,2.4094512754223401E-2,1.9336343623286002E-2,null,50000,4.5117222392161198E-2,3.1294656312230502E-2,2.4306978732638599E-2,1.9531018361853801E-2]
[100000,4.4643521056610999E-2,3.0787481830418802E-2,2.3861947734624699E-2,1.9185674289607001E-2,null,null,100000,4.4946429656077501E-2,3.1050685596939999E-2,2.4052138604736199E-2,1.9314779485910202E-2,null,100000,4.50982310107607E-2,3.1288430632367997E-2,2.4285687575320899E-2,1.9509334808359299E-2]
{"$rows_left_out":1994}